ha categoria del punto di interesse
type: ObjectProperty
version info: stabile
version info: stable @en
domain: PointOfInterest
label: has point of interest category @en
comment: Questa proprietà lega il punto di inreresse alla sua categoria generale.
comment: This property links the point of interest to its general cateogry. @en
inverse of: isPOICategoryFor
range: PointOfInterestCategory