ha name in time of the point of interest
type: ObjectProperty
label: ha nome nel tempo del punto di interesse @it
range: POINameInTime
version info: unstable
version info: provvisoria @it
comment: Questa proprietà lega il punto di interesse alla situazione (evento) del suo nome ch ecambia nel tempo. @it
comment: This property lnks the point of time to the situation (event) of its name that changes over time.
domain: PointOfInterest
inverse of: isPOINameInTimeFor