ha nome nel tempo del punto di interesse
type: ObjectProperty
comment: Questa proprietà lega il punto di interesse alla situazione (evento) del suo nome ch ecambia nel tempo.
comment: This property lnks the point of time to the situation (event) of its name that changes over time. @en
domain: PointOfInterest
label: ha name in time of the point of interest @en
range: POINameInTime
inverse of: isPOINameInTimeFor
version info: unstable @en
version info: provvisoria