include punto di interesse
type: ObjectProperty
comment: Questa proprietà lega un punto di interesse multiplo a tutti i punti di interesse in esso contenuti.
label: includes point of interest @en
inverse of: isIncludedInPOI
version info: stable @en
range: PointOfInterest
domain: MultiplePointOfInterest
version info: stabile
comment: This property links a multiple point of interest with all the points of interest included in it. @en