is included in point of interest
type: ObjectProperty
comment: Inverse property of "includes point of interest".
comment: Proprietà inversa di "include punto di interesse". @it
domain: PointOfInterest
label: è incluso nel punto di interesse @it
range: MultiplePointOfInterest
version info: stabile @it
version info: stable