è nome nel tempo del punto di interesse per
type: ObjectProperty
version info: provvisoria
range: PointOfInterest
version info: unstable @en
label: is point of interest name in time for @en
type: FunctionalProperty
comment: Inverse property of "has point of interest name in time". @en
comment: Proprietà inversa di "ha nome nel tempo del punto di interesse".
domain: POINameInTime