is point of interest status for
type: ObjectProperty
domain: POIState
version info: stabile @it
range: PointOfInterest
comment: inverse property of "has point of interest status".
label: è stato del punto di interesse per @it
version info: stable
comment: Proprietà inversa di "ha stato del punto di interesse". @it