Offer
type: Class
subclass of: Restriction
  some values from: PriceSpecification
  on property: hasPriceSpecification
version info: stabile @it
description: Any fare is expressed within the ontology by using instances of the class Offer. It is possible to specify: * the type of user to whom the offer is applicable (cf. object property cis:hasEligibleUser); * the information about the price (cf. object property hasPriceSpecification); * the information about the temporal validity of the offer (cf. object property hasValidity); * the association with a ticket (cf. object property includes).
comment: Concetto utilizzato per rappresentare offerte (riduzioni per specifiche categorie di utenti o importo intero). @it
label: Offerta @it
subclass of: Restriction
  all values from: Validity
  on property: hasValidity
subclass of: Restriction
  all values from: Ticket
  on property: includes
subclass of: Restriction
  all values from: Literal
  on property: description
subclass of: Description
version info: stable
comment: It represents an offer (reduction for specific types of users or base price).