Price Specification
type: Class
subclass of: Restriction
  some values from: double
  on property: hasCurrencyValue
subclass of: Restriction
  some values from: Currency
  on property: hasCurrency
subclass of: Characteristic
subclass of: Restriction
  max cardinality: 1
  on property: VAT
version info: stabile @it
version info: stable
label: Prezzo @it
description: A price specification provides the information about the cost of an offer. It is associated to a currency (e.g., Euro) and a currency value (i.e., a quantity, e.g., 5).
comment: It represents the price specification of the ticket
comment: Rappresenta la specifica del prezzo del biglietto. @it