Ticket
type: Class
comment: It represents an entrance ticket for a Cultural Institute or Site, if required, and for an event
comment: Rappresenta il biglietto d'ingresso per l'Istitituto e Luogo della Cultura, qualora sia previsto, e per l'evento culturale. @it
label: Biglietto @it
subclass of: Object
subclass of: Restriction
  all values from: Literal
  on property: description
subclass of: Restriction
  on property: name
  some values from: Literal
subclass of: Restriction
  all values from: Literal
  on property: description
subclass of: Restriction
  all values from: Class
    union of: CulturalEvent
  on property: forAccessTo
subclass of: Restriction
  all values from: Validity
  on property: hasValidity
version info: stable
version info: stabile @it