for access to
type: ObjectProperty
domain: Ticket
label: per l'accesso a @it
comment: Property used to associate a ticket to an event or location
comment: Proprietà che consente di associare un biglietto a un evento o a un luogo @it
version info: stable
version info: stabile @it
inverse of: hasTicket
range: Class
  union of: EventOrSituation
  union of: Location