ha offerta
type: ObjectProperty
range: Offer
version info: stabile
comment: This property links anything to an offer @en
comment: Questa proprietà collega un qualsiasi cosa a un'offerta
version info: stable @en
label: has offer @en
domain: Thing