ha validità
type: ObjectProperty
comment: Proprietà utilizzata per specificare una validità di un offerta o di un biglietto.
comment: Property used to specify the validity of an offer or ticket. @en
domain: Class
  union of: Offer
  union of: Ticket
label: has validity @en
range: Validity
version info: stable
version info: stabile