Time indexed role
type: Class
subclass of: Restriction
  some values from: Role
  on property: withRole
version info: stable
subclass of: Restriction
  some values from: TemporalEntity
  on property: hasTemporalEntity
label: Ruolo nel tempo @it
subclass of: EventOrSituation
comment: Rappresentazione di un ruolo associato ad un intervallo temporale determinato. @it
subclass of: Restriction
  some values from: Agent
  on property: isRoleInTimeOf
comment: Representation of Role with a clearly defined time extension.
subclass of: Restriction
  some values from: Entity
  on property: forEntity
version info: stabile @it