per entità
type: ObjectProperty
version info: versione non definitiva
version info: unstable @en
inverse of: hasRiT
range: Entity
domain: TimeIndexedRole
comment: Proprietà che collega la situazione (per la gestione del ruolo) a un'entità per cui un'altra ha un ruolo.
comment: Property that links a time indexed role to an entity (for which onother plays a role). @en
label: for entity @en