holds role in time
type: ObjectProperty
range: TimeIndexedRole
domain: Agent
sub property of: hasRiT
label: riveste ruolo nel tempo @it
comment: The relation between an entity and a role in time.
comment: Relazione tra un'entità generica ed un ruolo nel tempo. @it
inverse of: isRoleInTimeOf