è ruolo nel tempo di
type: ObjectProperty
type: FunctionalProperty
version info: stabile
version info: stable @en
range: Agent
comment: Inverse property of holds role in time @en
comment: Proprietà inversa di ha ruolo nel tempo
label: is role in time of @en
domain: TimeIndexedRole