is role in time of
type: ObjectProperty
type: FunctionalProperty
comment: Inverse property of holds role in time
comment: Proprietà inversa di ha ruolo nel tempo @it
domain: TimeIndexedRole
label: è ruolo nel tempo di @it
range: Agent
version info: stabile @it
version info: stable