con ruolo
type: ObjectProperty
comment: Associazione tra un TimeIndexedRole ed un Role.
comment: Association between a TimeIndexedRole and a Role. @en
domain: TimeIndexedRole
range: Role
inverse of: isRoleIn
label: with role @en
type: FunctionalProperty