Contact Point
type: Class
version info: stable
version info: stabile @it
comment: A contact point that can be physical or available online
comment: Un punto di contatto che può essere fisico o disponibile online @it
label: Punto di Contatto @it
subclass of: Object