Email
type: Class
subclass of: Object
was influenced by: Email
subclass of: Restriction
  on data range: anyURI
  qualified cardinality: 1
  on property: emailAddress
comment: Questa classe rappresenta l'indirizzo email del punto di contatto di un'organizzazione. La classe è collegata al tipo di email. Nell'ambito itailano si identificano due tipi principali di email, la PEC e l'email tradizionale. @it
subclass of: Restriction
  qualified cardinality: 1
  on class: EmailType
  on property: hasEmailType
subclass of: Restriction
  qualified cardinality: 1
  on class: OnlineContactPoint
  on property: isEmailOf
comment: This class represents the Email address of the contact point of an organization. The class is linked to the type of email that can be specified. In the Italian context we identify two types of Emails; namely, Certified Electronic Email and Traditional Email addresses.