Email Type
type: Class
version info: stable
comment: Questa classe rappresenta i tipo di email e può assumere due valori come definiti nel vocabolario controllato dei canali di erogazione dei servizi (https://w3id.org/italia/controlled-vocabulary/classifications-for-public-services/channel). Nello specifico le istanze di questa classe sono: https://w3id.org/italia/controlled-vocabulary/classifications-for-public-services/channel/042 (Email tradizionale) e https://w3id.org/italia/controlled-vocabulary/classifications-for-public-services/channel/041 (PEC). @it
version info: stabile @it
subclass of: Restriction
  all values from: Email
  on property: isEmailTypeOf
label: Tipo di email @it
subclass of: Concept
comment: This class represents the type of email. It can assume two values that are defined in the Channel controlled vocabulary https://w3id.org/italia/controlled-vocabulary/classifications-for-public-services/channel. In particular, the istances of this class are https://w3id.org/italia/controlled-vocabulary/classifications-for-public-services/channel/041 (Certified Electronic Mail) and https://w3id.org/italia/controlled-vocabulary/classifications-for-public-services/channel/042 (E-mail).