Online Contact Point
type: Class
comment: This class represents an online contact point; that is, an object that groups a set of types of online (social) media channels such as email, social network contacts, web site, ecc.
comment: Questa classe rappresenta un punto di contatto online. Essa raggruppa un insieme di tipi di canali di contatto online come account di social network, email, siti web, ecc. @it
label: Punto di Contatto Online @it
subclass of: ContactPoint
subclass of: Restriction
  all values from: UserAccount
  on property: hasUserAccount
subclass of: Restriction
  all values from: WebSite
  on property: hasWebSite
subclass of: Restriction
  on property: hasEmail
  some values from: Email
subclass of: Restriction
  all values from: Telephone
  on property: hasTelephone
disjoint with: PhysicalContactPoint
version info: stabile @it
version info: stable
was influenced by: ContactPoint