Social media
type: Class
comment: This class represents a social media like a social network (e.g. Facebook, Twitter, etc.). @en
comment: Questa classe rappresenta un social media come, ad esempio, un social network (ex. Facebook, Twitter, ecc...).
subclass of: Restriction
  cardinality: 1
  on property: socialMediaName
subclass of: Object