URL
type: DatatypeProperty
version info: provvisoria
version info: unstable @en
comment: Questa proprietà rappresenta un URL di una qualsiasi cosa del dominio modellato.
comment: This property represents a general URL associated with any thing of the modelled domain. @en
range: anyURI
domain: Thing