Account utente
type: Class
subclass of: Object
subclass of: Restriction
  qualified cardinality: 1
  on class: SocialMedia
  on property: isAccountIssuedBy
subclass of: Restriction
  max qualified cardinality: 1
  on data range: string
  on property: userAccountName
subclass of: Restriction
  qualified cardinality: 1
  on class: OnlineContactPoint
  on property: isUserAccountOf
was influenced by: ns#
subclass of: Restriction
  max qualified cardinality: 1
  on data range: anyURI
  on property: URL
label: User account @en
was influenced by: OnlineAccount
comment: This class represents a user account, such as the account owned by a person on a social network. @en
comment: Questa classe rappresenta un account come quello che può possedere un utente su un social network.