miglior valutazione utente
type: DatatypeProperty
version info: stabile
version info: stable @en
domain: Rating
comment: Tra tutte le valutazioni rappresenta la migliore
comment: Among all user rating scores it represents the best one @en
label: best user rating @en
sub property of: userRating
range: Literal