has contact point
type: ObjectProperty
version info: stable
comment: Proprietà che consente di specificare un punto di contatto associato a una cosa del dominio modellato. @it
version info: stabile @it
range: ContactPoint
label: ha punto di contatto @it
domain: Thing
comment: Property that allows one to specify a contact point for a thing.