ha email
type: ObjectProperty
comment: Questa proprietà collega un punto di contatto online con uno o più indirizzi email di vario tipo.
comment: This property links an online contact point with one or more email addresses of various types. @en
range: Email
domain: OnlineContactPoint
label: has email @en
inverse of: isEmailOf