ha tipo email
type: ObjectProperty
comment: This property links the Email to its type. @en
label: has email type @en
range: EmailType
comment: Questa proprietà collega l'email al suo tipo.
domain: Email
type: FunctionalProperty
inverse of: isEmailTypeOf