has image
type: ObjectProperty
comment: This property links anything to an image.
comment: Questa proprietà collega qualsiasi cosa ad un'immagine. @it
range: Image
domain: Thing
label: ha immagine @it
inverse of: isImageOf