ha punto di contatto online
type: ObjectProperty
sub property of: hasContactPoint
label: has online contact point @en
domain: Thing
range: OnlineContactPoint
version info: stabile
inverse of: isOnlineContactPointOf
comment: Questa proprietà lega qualsiasi cosa del dominio modellato a un punto di contatto online.
comment: This property links any thing of the domain being modelled with the online contact point. @en