ha punto di contatto online
type: ObjectProperty
comment: Questa proprietà lega qualsiasi cosa del dominio modellato a un punto di contatto online.
comment: This property links any thing of the domain being modelled with the online contact point. @en
domain: Thing
label: has online contact point @en
range: OnlineContactPoint
sub property of: hasContactPoint
inverse of: isOnlineContactPointOf
version info: stabile