has rating
type: ObjectProperty
comment: Property that links anything to a possible rating.
comment: Proprietà che collega qualsiasi cosa a una possibile valutazione generale. @it
domain: Thing
label: ha valutazione @it
range: Rating
version info: stable
version info: stabile @it