ha account utente
type: ObjectProperty
domain: OnlineContactPoint
inverse of: isUserAccountOf
sub property of: topObjectProperty
comment: This property links an online contactPoint to its user account. @en
comment: Questa proprietà collega un punto di contatto online al suo account utente.
range: UserAccount
label: has user account @en