è account rilasciato da
type: ObjectProperty
comment: Questa proprietà rappresenta la relazione tra un social media e gli account utenti che sono stati rilasciati su tale media.
comment: This property represents the relation between a social media and the user account issued by such a social media. @en
range: SocialMedia
domain: UserAccount
label: is account issued by @en
inverse of: issuesAccount