is email type of
type: ObjectProperty
comment: Inverse property of has email type. Hence, this property links an email type to an email.
comment: Proprietà inversa di 'ha tipo di email'. Di conseguenza, questa proprietà collega un individuo della classe 'Tipo di email' ad un individuo della classe 'Email'. @it
range: Email
domain: EmailType
label: è tipo di email di @it