is telephone type of
type: ObjectProperty
range: Telephone
label: è tipo di telefono di @it
comment: Proprietà inversa di "ha tipo di telefono". @it
comment: Inverse property of "has telephone type".
version info: stable
version info: stabile @it
domain: TelephoneType