è tipo di telefono di
type: ObjectProperty
comment: Proprietà inversa di "ha tipo di telefono".
comment: Inverse property of "has telephone type". @en
domain: TelephoneType
label: is telephone type of @en
range: Telephone
version info: stable @en
version info: stabile