is Web site of
type: ObjectProperty
comment: Relation between a Web site and the entity this Web site is associated with. This property is the inverse of 'has Web site'.
comment: Relazione tra un sito Web e l'entità a cui il sito Web è associato. Questa proprietà è l'inversa di 'ha sito Web'. @it
range: Thing
domain: WebSite
label: è sito Web di @it