social media name
type: DatatypeProperty
type: FunctionalProperty
comment: The name associated with a social media entity.
comment: Il nome associato con un individuo che rappresenta un social media. @it
domain: SocialMedia
label: nome di social media @it
range: Literal
sub property of: name