numero di telefono
type: FunctionalProperty
version info: stabile
version info: stable @en
domain: Telephone
type: DatatypeProperty
label: telephone number @en
comment: Questa proprietà consente di rappresentare il numero di telefono.
comment: This property represents the telephone number @en
range: Literal