valutazione utente
type: DatatypeProperty
range: Literal
label: user rating @en
version info: stable @en
version info: stabile
comment: This property represents a user evaluation/rating expressed as 1,2,3,4,5 or any other type of rating associated with a review. @en
comment: Questa proprietà rappresenta una valutazione dell'utente espressa come 1,2,3,4,5 oppure ogni altro tipo di valutazione associata a una recensione.
domain: Rating