user rating
type: DatatypeProperty
comment: This property represents a user evaluation/rating expressed as 1,2,3,4,5 or any other type of rating associated with a review.
comment: Questa proprietà rappresenta una valutazione dell'utente espressa come 1,2,3,4,5 oppure ogni altro tipo di valutazione associata a una recensione. @it
domain: Rating
label: valutazione utente @it
range: Literal
version info: stable
version info: stabile @it