worst user rating
type: DatatypeProperty
label: peggior valutazione utente @it
version info: stabile @it
version info: stable
range: Literal
sub property of: userRating
domain: Rating
comment: Among all the rating associated with a thing of the modelled domain, it represents the worst rating.
comment: Tra tutte le valutazioni rispetto a una cosa del dominio da modellare, rappresenta la peggior valutazione. @it