Giorno della settimana
type: Class
disjoint with: MonthOfYear
disjoint with: Year
comment: Classe che rappresenta l'insieme dei giorni della settimana.
comment: This class represents the set of all the days of the week. @en
label: Day of the Week @en
subclass of: TemporalEntity