Month of the year
type: Class
disjoint with: Year
comment: This class represents a month of the year.
comment: Questa classe rappresenta un mese dell'anno. @it
label: Mese dell'anno @it
subclass of: Restriction
  max qualified cardinality: 1
  on data range: gMonth
  on property: month
subclass of: TemporalEntity