end date
type: DatatypeProperty
comment: This property represents the end date of a time interval.
comment: Questa proprietà rappresenta la data di fine di un intervallo temporale. @it
range: Datatype
  union of: date
  union of: dateTime
domain: TimeInterval
label: data di fine @it
sub property of: time