ha giorno della settimana
type: ObjectProperty
comment: Questa proprietà è utilizzata per associare un oggetto che può essere collocato nel tempo ai giorni della settimana.
comment: This property relates any object to particular day of the week. @en
range: DayOfWeek
domain: Thing
label: has day of week @en
inverse of: isDayOfWeekOf
sub property of: hasTemporalEntity