has temporal entity
type: ObjectProperty
comment: Property that links a time indexed event to a temporal entity.
comment: Proprietà che collega un evento nel tempo ad un entità temporale. @it
range: TemporalEntity
domain: Thing
label: ha entità temporale @it
inverse of: isTemporalEntityOf